{"text_format":"1","workbook":"xlsx","n_sheets":3,"sheets":["Arc Worksheet","Drop Tables","Color List 2"],"not_rendered":{"charts":0,"images":1,"macros":1,"external_links":0,"defined_names":51,"comments":0,"pivot_tables":0},"unopened":[],"bounds":{"document_bytes":16777216,"sheet_cells":100000,"rows_first":2000,"rows_last":500,"rows_between":2000,"halvings":0,"cell_chars":16384,"cell_head_chars":4096},"cells_cut":0,"cells_raw":0,"read":"whole","date_system":"1900"}

{"sheet":"Arc Worksheet","index":0,"n_rows":90,"n_cols":22,"rows_kept":90,"cut":false,"hidden":false,"merged":[[87,3,87,15],[88,3,88,15],[26,18,26,21],[22,18,25,21],[37,3,38,6],[50,3,50,21],[54,3,54,21],[56,3,57,21],[60,3,60,20],[62,3,62,4],[63,3,63,18],[65,3,67,19],[82,3,82,15],[83,3,83,15],[84,3,84,15],[85,3,85,15],[86,3,86,15],[78,3,78,15],[77,3,77,21],[79,3,79,21],[80,3,80,21],[81,3,81,21],[68,3,68,15],[73,3,73,15],[76,3,76,15],[69,3,72,20],[74,3,75,20],[61,3,61,15],[64,3,64,15],[55,3,55,15],[58,3,58,15],[59,3,59,15],[51,3,51,15],[52,3,52,15],[53,3,53,15],[44,3,46,11],[44,13,46,21],[24,3,24,6],[24,8,24,11],[18,18,18,21],[24,13,24,16],[27,3,27,6],[25,3,25,6],[25,8,25,11],[25,13,25,16],[27,18,27,21],[22,3,22,6],[19,3,19,6],[22,8,22,11],[18,13,18,16],[19,19,19,21],[18,3,18,6],[21,8,21,11],[28,3,28,6],[41,3,41,6],[42,3,42,6],[30,8,30,11],[35,3,36,21],[38,8,38,11],[39,8,39,11],[30,13,30,16],[31,3,32,6],[31,8,32,11],[31,13,32,16],[39,3,39,6],[1,8,5,16],[6,3,8,21],[9,3,9,6],[9,8,9,11],[9,13,9,16],[9,18,9,21],[89,3,90,21],[12,8,12,11],[12,3,12,4],[19,13,19,16],[12,5,12,6],[12,18,12,21],[12,13,12,16],[15,10,16,15],[18,8,18,11],[19,8,19,11],[21,18,21,21],[21,3,21,6],[41,8,41,11],[42,8,42,11],[39,13,42,21],[30,3,30,6],[10,18,10,21],[11,8,11,11],[11,13,11,16],[11,18,11,21],[10,3,10,6],[10,8,10,11],[10,13,10,16],[11,5,11,6],[11,3,11,4]]}
[]
[null,null,null,null,null,null,null,null,"Vertical Surfaces"]
[]
[]
[]
[]
[null,null,null,"Project Information"]
[]
[]
[null,null,null,"Architect/Designer",null,null,null,null,"Project Name",null,null,null,null,"Email",null,null,null,null,"Phone"]
[]
[null,null,null,"Country",null,"State/Province",null,null,"Location Details",null,null,null,null,"Stone and Steel Representative",null,null,null,null,"Cloud for Sales ID #"]
[]
[]
[]
[null,null,null,null,null,null,null,null,null,null,"Surface Information"]
[]
[]
[null,null,null,"Quantity",null,null,null,null,"Material Type",null,null,null,null,"Material Brand",null,null,null,null,"Material Color"]
[]
[]
[null,null,null,"Finish",null,null,null,null,"Edge Detail",null,null,null,null,null,null,null,null,null,"Application Description"]
[null,null,null,null,null,null,null,null,null,null,null,null,null,null,null,null,null,null,"Please decribe where these surfaces will be located and what their purpose will be"]
[]
[null,null,null,"Size (Length)",null,null,null,null,"Size (Height)",null,null,null,null,"Size (Depth)"]
[]
[]
[null,null,null,"Drawing Requested?",null,null,null,null,null,null,null,null,null,null,null,null,null,null,"Notes"]
[]
[]
[null,null,null,"Approval Name",null,null,null,null,"Approvers Title",null,null,null,null,"Date (mm/dd/yyyy)"]
[]
[]
[]
[null,null,null,null,null,null,null,null,null,null,null,null,null,null,null,null,null,null,null,null,null,"V02.20.19-1"]
[null,null,null,"Internal Use Only"]
[]
[null,null,null,"Internal Stone and Steel Representative"]
[null,null,null,null,null,null,null,null,"Compliance Notes (If App)",null,null,null,null,"Additional Notes:"]
[]
{"$rows_left_out":51}
{"sheet":"Drop Tables","index":1,"n_rows":412,"n_cols":21,"rows_kept":412,"cut":false,"hidden":true,"merged":[]}
["Yes/No1","Country","CA State List","US State List","Rep List","Model","Yes/No2","Material Name","Material Code","Trough Style","Station Quantity","Stone and Steel Reps.","Stone Type","Material","Edge Detail","Material","Material Color List","Color Category","Color Code","Color Group","Finish"]
["Yes","Canada","Alberta","Alabama","American Sales Co.","AD","Yes","Caeserstone","E0001","Continuous Trough",1,"EP&D","Solid_Surface","Corian","Beveled","Caeserstone","Alpine Mist","D",0,"A","Polished/Smooth"]
["No","United States","British Columbia","Alaska","Aspinall Associates","DSG","No","Corian","C0002","Individual Basin",2,"BBN","Quartz","LG","Straight","Caeserstone","Atlantic Salt","B",0,"B","Matte/Leather"]
["N/A","Other","Manitoba","Arkansas","Badgerland Trading","DSCT","Yes","Corian_Quartz","S0003",null,3,"Braley Gray","Plastic_Laminate","Other","Rounded","Caeserstone","Bianco Drift","D",0,"C"]
[null,null,"New Brunswick","Arizona","BBN Sales","DSOF","No","Silestone","Z0004","Individual Basin",4,"Delco","Natural_Stone","Corian_Quartz",null,"Caeserstone","Blizzard","A","0108095","D"]
[null,null,"Newfoundland & Labrador","California","Braley Gray","DSVR",null,"Other","O0005",null,5,"Dillard","Exotic","Silestone",null,"Caeserstone","Calacatta Nuovo","E",0,"E"]
[null,null,"Northwest Territories","Colorado","Burns Cope","DSWD",{"$f":"IF(OR('Arc Worksheet'!#REF!='Drop Tables'!F2,'Arc Worksheet'!#REF!='Drop Tables'!F3),\"AD\",#N/A)","v":{"$error":"#REF!"}},null,null,null,"6+","Diversified","Other","Caeserstone",null,"Caeserstone","Clamshell","B",0,{"$error":"#N/A"}]
[null,null,"Nova Scotia","Connecticut","C.A. Riner",null,{"$f":"IF(OR('Arc Worksheet'!#REF!='Drop Tables'!F6,'Arc Worksheet'!#REF!='Drop Tables'!F5,'Arc Worksheet'!#REF!='Drop Tables'!F4),\"Basin\",\"Trough\")","v":{"$error":"#REF!"}},null,null,null,null,"Dobbin",null,"Cambria",null,"Caeserstone","Coastal Grey","D",0]
[null,null,"Nunavut","Delaware","Clapper Co.",null,{"$f":"IF('Arc Worksheet'!N26='Drop Tables'!L4,\"Laminate\",\"#N/A\")","v":"#N/A"},null,null,null,null,"Engineered Concepts",null,"Geolux",null,"Caeserstone","Concrete","A","0108099"]
[null,null,"Ontario","Florida","Delco Sales",null,"Yes",null,null,null,null,"Joyce",null,"Lapitec",null,"Caeserstone","Cosmopolitan White","D",0]
[null,null,"Prince Edward Island","Georgia","Dillard Associates - SA",null,"No",null,null,null,null,"Kliman",null,"Aurea Stone",null,"Caeserstone","Dreamy Marfil","D",0]
[null,null,"Quebec","Hawaii","Dillard Associates",null,"Yes",null,null,null,null,"Maloney & Curcio",null,"Wilsonart",null,"Caeserstone","Eggshell","A",0]
[null,null,"Saskatchewan","Idaho","Diversified Spec.",null,"No",null,null,null,null,"Pannell",null,"Other",null,"Caeserstone","Fresh Concrete","D",0]
[null,null,"Yukon","Illinois","Edwards, Platt, & Deely",null,null,null,null,null,null,"RBA",null,"Egger",null,"Caeserstone","Frosty Carrina","D",0]
[null,null,null,"Indiana","Engineered Concepts",null,{"$f":"IF('Arc Worksheet'!#REF!=\"DSWD\",\"Basin\",\"No\")","v":{"$error":"#REF!"}},null,null,null,null,"RE Fitzpatrick",null,"Formica",null,"Caeserstone","Geogian Bluffs","D",0]
[null,null,null,"Iowa","Hamel Associates",null,"Yes",null,null,null,null,"Repco",null,"Nevamar",null,"Caeserstone","Ginger","A",0]
[null,null,null,"Kansas","Hebco",null,"No",null,null,null,null,"SDAJ",null,"Octolam",null,"Caeserstone","Haze","B",0]
[null,null,null,"Kentucky","J.B. O'Connor Co. Inc.",null,null,null,null,null,null,"Smith & Stevenson",null,"Wilsonart",null,"Caeserstone","Jet Black","B",0]
[null,null,null,"Louisiana","J.H. Pokorny Associates",null,null,null,null,null,null,"Tri-Rep",null,"Other",null,"Caeserstone","Lagos Blue","B",0]
[null,null,null,"Maine","Joyce Agency",null,null,null,null,null,null,"WG Lesemann",null,"Granite",null,"Caeserstone","Linen","B",0]
[null,null,null,"Maryland","Kliman Sales Inc.",null,null,null,null,null,null,null,null,"Marble",null,"Caeserstone","London Grey","D",0]
[null,null,null,"Massachusetts","M & M Sales Inc.",null,null,null,null,null,null,null,null,"Quartzite",null,"Caeserstone","Montblanc","D",0]
[null,null,null,"Michigan","Maloney & Curcio",null,null,null,null,null,null,null,null,"Sandstone",null,"Caeserstone","Moorland Fog","B",0]
[null,null,null,"Minnesota","Marshall-Rodeno",null,null,null,null,null,null,null,null,"Travertine",null,"Caeserstone","Nobel Grey","D",0]
[null,null,null,"Mississippi","Mendell Sales",null,null,null,null,null,null,null,null,"Other",null,"Caeserstone","Nougat","A",0]
[null,null,null,"Missouri","Midwest Spec.",null,null,null,null,null,null,null,null,"Dekton",null,"Caeserstone","Ocean Foam","B",0]
[null,null,null,"Montana","Pannell",null,null,null,null,null,null,null,null,"Neolith",null,"Caeserstone","Organic White","B",0]
[null,null,null,"Nebraska","Premier Marketing",null,null,null,null,null,null,null,null,"Other",null,"Caeserstone","Pebble","B",0]
[null,null,null,"Nevada","R.E. Fitzpatrick",null,null,null,null,null,null,null,null,"Other Material",null,"Caeserstone","Piatra Grey","D",0]
[null,null,null,"New Hampshire","Repco",null,null,null,null,null,null,null,null,null,null,"Caeserstone","Pure White","D",0]
[null,null,null,"New Jersey","Service Reps Inc.",null,null,null,null,null,null,null,null,null,null,"Caeserstone","Quartz Reflections","B",0]
[null,null,null,"New Mexico","Service Reps Inc. - IA",null,null,null,null,null,null,null,null,null,null,"Caeserstone","Raven","B",0]
[null,null,null,"New York","Smith & Stevenson",null,null,null,null,null,null,null,null,null,null,"Caeserstone","Raw Concrete","D",0]
[null,null,null,"North Carolina","Southern Spec",null,null,null,null,null,null,null,null,null,null,"Caeserstone","Rugged Concrete","D",0]
[null,null,null,"North Dakota","Southwestern Mech - AZ",null,null,null,null,null,null,null,null,null,null,"Caeserstone","Shitake","B",0]
[null,null,null,"Ohio","Southwestern Mech - NV",null,null,null,null,null,null,null,null,null,null,"Caeserstone","Sleek Concrete","B",0]
[null,null,null,"Oklahoma","Stone, Drew, Ashe, Jones",null,null,null,null,null,null,null,null,null,null,"Caeserstone","Statuario Maximus","E",0]
[null,null,null,"Oregon","Stone, Drew, Ashe, Jones - AK",null,null,null,null,null,null,null,null,null,null,"Caeserstone","Statuario Nuovo","E",0]
[null,null,null,"Pennsylvania","Superior Products",null,null,null,null,null,null,null,null,null,null,"Caeserstone","Sympony Grey","D",0]
[null,null,null,"Rhode Island","Tri-Rep Sales",null,null,null,null,null,null,null,null,null,null,"Caeserstone","Taj Royal","D",0]
{"$rows_left_out":373}
{"sheet":"Color List 2","index":2,"n_rows":288,"n_cols":18,"rows_kept":288,"cut":false,"hidden":true,"merged":[]}
["Material Type","Brand","Color","Matl-Color","JP COLOR","Price Group","SAP Code","PriceCode","Supplier Color Code","Color Code","Ext Color Code","USE THIS",null,"IF Blank 000000",null,"Sink Color","Category","Code"]
["Quartz","Caeserstone","Alpine Mist",{"$f":"A2& \" - \" & C2","v":"Quartz - Alpine Mist"},{"$f":"A2&\" - \"&B2&\" - \"&C2","v":"Quartz - Caeserstone - Alpine Mist"},"C",null,"Quartz D",5110,"AMI",{"$f":"\"N\"&J2","v":"NAMI"},"D",null,null,null,"Silestone - Albedo***",{"$error":"#N/A"},{"$f":"IFERROR(VLOOKUP(P2,E:G,6,0),\"0000000\")","v":"0000000"}]
["Quartz","Caeserstone","Atlantic Salt","Quartz - Atlantic Salt",{"$f":"A3&\" - \"&B3&\" - \"&C3","v":"Quartz - Caeserstone - Atlantic Salt"},"B",null,"Quartz B",6270,"ASA","NASA","B",null,null,null,"Silestone - Aquatint***",{"$error":"#N/A"},"0000000"]
["Quartz","Caeserstone","Bianco Drift","Quartz - Bianco Drift","Quartz - Caeserstone - Bianco Drift","C",null,"Quartz D",6131,"BDR","NBDR","D",null,null,null,"Silestone - Ariel***",{"$error":"#N/A"},"0000000"]
["Quartz","Caeserstone","Blizzard","Quartz - Blizzard","Quartz - Caeserstone - Blizzard","A","0108095","Quartz A",2141,"BLI","NBLI","A",null,null,null,"Silestone - Bianco River","D","0000000"]
["Quartz","Caeserstone","Calacatta Nuovo","Quartz - Calacatta Nuovo","Quartz - Caeserstone - Calacatta Nuovo","E",null,"Quartz E",5131,"CAL","NCAL","E",null,null,null,"Silestone - Blanco Orion","D","0000000"]
["Quartz","Caeserstone","Clamshell","Quartz - Clamshell","Quartz - Caeserstone - Clamshell","B",null,"Quartz B",4130,"CLA","NCLA","B",null,null,null,"Silestone - Coppermist***",{"$error":"#N/A"},"0000000"]
["Quartz","Caeserstone","Coastal Grey","Quartz - Coastal Grey","Quartz - Caeserstone - Coastal Grey","C",null,"Quartz D",6003,"CGR","NCGR","D",null,null,null,"Silestone - Cygnus Suede","H","0000000"]
["Quartz","Caeserstone","Concrete","Quartz - Concrete","Quartz - Caeserstone - Concrete","A","0108099","Quartz A",2003,"CCR","NCCR","A",null,null,null,"Silestone - Daria Suede","J","0000000"]
["Quartz","Caeserstone","Cosmopolitan White","Quartz - Cosmopolitan White","Quartz - Caeserstone - Cosmopolitan White","C",null,"Quartz D",5130,"CWH","NCWH","D",null,null,null,"Silestone - Eternal Serena***",{"$error":"#N/A"},"0000000"]
["Quartz","Caeserstone","Dreamy Marfil","Quartz - Dreamy Marfil","Quartz - Caeserstone - Dreamy Marfil","C",null,"Quartz D",5220,"DMA","NDMA","D",null,null,null,"Silestone - Grey Amazon","D","0000000"]
["Quartz","Caeserstone","Eggshell","Quartz - Eggshell","Quartz - Caeserstone - Eggshell","A",null,"Quartz A",3141,"EGG","NEGG","A",null,null,null,"Silestone - Grey Expo***",{"$error":"#N/A"},"0000000"]
["Quartz","Caeserstone","Fresh Concrete","Quartz - Fresh Concrete","Quartz - Caeserstone - Fresh Concrete","C",null,"Quartz D",4001,"FCR","NFCR","D",null,null,null,"Silestone - Hudson***",{"$error":"#N/A"},"0000000"]
["Quartz","Caeserstone","Frosty Carrina","Quartz - Frosty Carrina","Quartz - Caeserstone - Frosty Carrina","C",null,"Quartz D",5141,"FCA","NFCA","D",null,null,null,"Silestone - Iconic White***",{"$error":"#N/A"},"0000000"]
["Quartz","Caeserstone","Geogian Bluffs","Quartz - Geogian Bluffs","Quartz - Caeserstone - Geogian Bluffs","C",null,"Quartz D",6134,"GBL","NGBL","D",null,null,null,"Silestone - Iron Bark***",{"$error":"#N/A"},"0000000"]
["Quartz","Caeserstone","Ginger","Quartz - Ginger","Quartz - Caeserstone - Ginger","A",null,"Quartz A",4330,"GIN","NGIN","A",null,null,null,"Silestone - Iron Ore***",{"$error":"#N/A"},"0000000"]
["Quartz","Caeserstone","Haze","Quartz - Haze","Quartz - Caeserstone - Haze","B",null,"Quartz B",2030,"HAZ","NHAZ","B",null,null,null,"Silestone - Koan***",{"$error":"#N/A"},"0000000"]
["Quartz","Caeserstone","Jet Black","Quartz - Jet Black","Quartz - Caeserstone - Jet Black","B",null,"Quartz B",3100,"JBL","NJBL","B",null,null,null,"Silestone - Marengo","A","0000000"]
["Quartz","Caeserstone","Lagos Blue","Quartz - Lagos Blue","Quartz - Caeserstone - Lagos Blue","B",null,"Quartz B",4350,"LBL","NLBL","B",null,null,null,"Silestone - Mountain Mist***",{"$error":"#N/A"},"0000000"]
["Quartz","Caeserstone","Linen","Quartz - Linen","Quartz - Caeserstone - Linen","B",null,"Quartz B",2230,"LIN","NLIN","B",null,null,null,"Silestone - Noka","A","0000000"]
["Quartz","Caeserstone","London Grey","Quartz - London Grey","Quartz - Caeserstone - London Grey","C",null,"Quartz D",5000,"LGR","NLGR","D",null,null,null,"Silestone - Nuit Bleue***",{"$error":"#N/A"},"0000000"]
["Quartz","Caeserstone","Montblanc","Quartz - Montblanc","Quartz - Caeserstone - Montblanc","C",null,"Quartz D",5043,"MBL","NMBL","D",null,null,null,"Silestone - Red Vital***",{"$error":"#N/A"},"0000000"]
["Quartz","Caeserstone","Moorland Fog","Quartz - Moorland Fog","Quartz - Caeserstone - Moorland Fog","B",null,"Quartz B",6046,"MLF","NMLF","B",null,null,null,"Silestone - Riverbed***",{"$error":"#N/A"},"0000000"]
["Quartz","Caeserstone","Nobel Grey","Quartz - Nobel Grey","Quartz - Caeserstone - Nobel Grey","C",null,"Quartz D",5211,"NGR","NNGR","D",null,null,null,"Silestone - Sienna Ridge***",{"$error":"#N/A"},"0000000"]
["Quartz","Caeserstone","Nougat","Quartz - Nougat","Quartz - Caeserstone - Nougat","A",null,"Quartz A",6600,"NOU","NNOU","A",null,null,null,"Silestone - Silver Nube***",{"$error":"#N/A"},"0000000"]
["Quartz","Caeserstone","Ocean Foam","Quartz - Ocean Foam","Quartz - Caeserstone - Ocean Foam","B",null,"Quartz B",6141,"OFO","NOFO","B",null,null,null,"Silestone - Starlight***",{"$error":"#N/A"},"0000000"]
["Quartz","Caeserstone","Organic White","Quartz - Organic White","Quartz - Caeserstone - Organic White","B",null,"Quartz B",4600,"OWH","NOWH","B",null,null,null,"Silestone - Stellar Night***",{"$error":"#N/A"},"0000000"]
["Quartz","Caeserstone","Pebble","Quartz - Pebble","Quartz - Caeserstone - Pebble","B",null,"Quartz B",4030,"PEB","NPEB","B",null,null,null,"Silestone - Tebas Black***",{"$error":"#N/A"},"0000000"]
["Quartz","Caeserstone","Piatra Grey","Quartz - Piatra Grey","Quartz - Caeserstone - Piatra Grey","C",null,"Quartz D",5003,"PIA","NPIA","D",null,null,null,"Silestone - Tigris Sand","D","0000000"]
["Quartz","Caeserstone","Pure White","Quartz - Pure White","Quartz - Caeserstone - Pure White","C",null,"Quartz D",1141,"PWH","NPWH","D",null,null,null,"Silestone - Urban Cream***",{"$error":"#N/A"},"0000000"]
["Quartz","Caeserstone","Quartz Reflections","Quartz - Quartz Reflections","Quartz - Caeserstone - Quartz Reflections","B",null,"Quartz B",7141,"QRE","NQRE","B",null,null,null,"Silestone - Verde Agua***",{"$error":"#N/A"},"0000000"]
["Quartz","Caeserstone","Raven","Quartz - Raven","Quartz - Caeserstone - Raven","B",null,"Quartz B",4120,"RAV","NRAV","B",null,null,null,"Silestone - White Diamond***",{"$error":"#N/A"},"0000000"]
["Quartz","Caeserstone","Raw Concrete","Quartz - Raw Concrete","Quartz - Caeserstone - Raw Concrete","C",null,"Quartz D",4004,"RCR","NRCR","D",null,null,null,"Silestone - White Dune***",{"$error":"#N/A"},"0000000"]
["Quartz","Caeserstone","Rugged Concrete","Quartz - Rugged Concrete","Quartz - Caeserstone - Rugged Concrete","C",null,"Quartz D",4033,"RGC","NRGC","D",null,null,null,"Silestone - White Zeus Extreme***",{"$error":"#N/A"},"0000000"]
["Quartz","Caeserstone","Shitake","Quartz - Shitake","Quartz - Caeserstone - Shitake","B",null,"Quartz B",4230,"SHI","NSHI","B",null,null,null,"Zodiaq - Antique Pearl","A","0000000"]
["Quartz","Caeserstone","Sleek Concrete","Quartz - Sleek Concrete","Quartz - Caeserstone - Sleek Concrete","B",null,"Quartz B",4003,"SCR","NSCR","B",null,null,null,"Zodiaq - Calacatta Natura","B","0000000"]
["Quartz","Caeserstone","Statuario Maximus","Quartz - Statuario Maximus","Quartz - Caeserstone - Statuario Maximus","E",null,"Quartz E",5031,"SMA","NSMA","E",null,null,null,"Zodiaq - Coarse Carrara","A","0000000"]
["Quartz","Caeserstone","Statuario Nuovo","Quartz - Statuario Nuovo","Quartz - Caeserstone - Statuario Nuovo","E",null,"Quartz E",5111,"SNU","NSNU","E",null,null,null,"Zodiaq - Coarse Marfil","A","0000000"]
["Quartz","Caeserstone","Sympony Grey","Quartz - Sympony Grey","Quartz - Caeserstone - Sympony Grey","C",null,"Quartz D",5133,"SGR","NSGR","D",null,null,null,"Zodiaq - Evergreen","A","0000000"]
["Quartz","Caeserstone","Taj Royal","Quartz - Taj Royal","Quartz - Caeserstone - Taj Royal","C",null,"Quartz D",5212,"TAJ","NTAJ","D",null,null,null,"Zodiaq - Galaxy Black","A","0000000"]
{"$rows_left_out":248}